SaveVideoHD
dTub.ru
ClipSaver.ru
SaveVideoHD
Русские видео
Смешные видео
Приколы
Обзоры
Новости
Тесты
Спорт
Любовь
Музыка
Разное
Сейчас в тренде
Фейгин лайф
Три кота
Самвел адамян
А4 ютуб
скачать бит
гитара с нуля
Иностранные видео
Funny Babies
Funny Sports
Funny Animals
Funny Pranks
Funny Magic
Funny Vines
Funny Virals
Funny K-Pop
Сортировка по релевантности
По дате
По просмотрам
Рейтинг
Последние добавленные видео:
Task-:app:compileDebugJavaWithJavac-FAILED
6 месяцев назад
[Solved] Execution failed for task ':shared_preferences_android:compileDebugJavaWithJavac'.
10062
6 месяцев назад
1:15
2 года назад
[Solved] How to Solve Could not determine the dependencies of task ‘:app:compileDebugJavaWithJavac’
26889
2 года назад
1:03
1 год назад
How to Fix: Execution failed for task ':app:compileDebugJavaWithJavac'
8547
1 год назад
2:37
3 года назад
How to Solve Could not determine the dependencies of task ‘:app:compileDebugJavaWithJavac’ flutter ?
44529
3 года назад
1:21
3 месяца назад
How to Fix app:compileDebugJavaWithJavac FAILED Error in React Native Project?
63
3 месяца назад
3:47
5 месяцев назад
Task :react-native-reanimated: compileDebugJavaWithJavac FAILED by MD Israr
1179
5 месяцев назад
3:11
2 года назад
How to fix "Could not determine the dependencies of task ' :app"compileDebugJavaWithJavac' "
4122
2 года назад
3:15
1 год назад
How to Fix compileDebugJavaWithJavac' task (current target is 1.8) In Android Studio
26616
1 год назад
1:06
1 месяц назад
Resolving the Execution Failed for Task ':app:compileDebugJavaWithJavac' Error in Android Studio
9
1 месяц назад
1:21
1 месяц назад
Resolving Execution failed for task ':app:compileDebugJavaWithJavac' in Your Android Flutter Project
5
1 месяц назад
1:35
1 год назад
Android : Execution Failed for task :app:compileDebugJavaWithJavac in Android Studio
353
1 год назад
1:10
7 месяцев назад
Java Build Failed in flutter application | Execution failed for task | Invalid source release
4919
7 месяцев назад
6:11
2 года назад
Task app:compileDebugJavaWithJavac failed
1209
2 года назад
4:40
2 года назад
Android : Execution failed for task ':app:compileDebugJavaWithJavac':
39
2 года назад
1:28
1 год назад
How to fix "Execution failed for task ':app:compileDebugKotlin'" | jvm target compatibility error.
25571
1 год назад
3:01
1 год назад
Task app:compileDebugJavaWithJavac failed
40
1 год назад
4:38
3 месяца назад
How to solve Execution failed for task ':android_intent_plus:compileDebugJavaWithJavac'. Flutter
100
3 месяца назад
1:33
2 года назад
Execution failed for task ':app:compileDebugKotlin' in Android Studio || Flutter || ERROR SOLVED ✅
55328
2 года назад
1:35
Следующая страница»